�^�C���X�^���v,�Q����������ɂ��Ă��������܂��B,���Ȃ��̐��ʂ������Ă��������I,���Ȃ��̔N��w�������Ă��������I,�ǂ����炫�܂������H,�E�Ƃ������Ă��������B,���ł��܂������H,����Ɨ��܂������H,�����̂���.meet.NIGHT�A�ǂ��Œm��܂������H,�O�͈�����āA�m���Ă܂��H,"10/2,3�̂���.meet.FES�ɎQ������܂������H",����meet�̊����ɎQ���������Ǝv���܂����B,����̂���meetNight�̃R���e���c�i�}���V�F�j�̗����ݒ�͂ǂ̂悤�Ɋ����܂������B,�}���V�F�͂������ł������B,�Ɩ��̉��o�ɂ��Ăǂ̂悤�Ɋ����܂������H,�ЊQ����z�肵�Ă��܂ǂŉ΂��g���܂����B�}���V�F��ʂ��Ėh�Ђ͈ӎ��ł��܂������H,����.meet.NIGHT�̂悤�ȃC�x���g�̊J�Âɂ��Ăǂ��v���܂����H,����.meet.NIGHT�Ɍ��炸�A�O�͈���ł͎Љ�����Ƃ��Č�����Ԃ▯�Ԓ��ԏ�ŏo�X�ł��܂��B�����g���o�X����ꍇ�A�ǂ�Ȃ��Ƃ��o�X�����ƂȂ�܂����H,����̃C�x���g�̏Ɩ��̉��o�ɂ��Ăǂ̂悤�Ɋ����܂������B,�ЊQ����z�肵�Ă��܂ǂŉ΂��g���܂����B�}���V�F��ʂ��Ėh�Ђ͈ӎ��ł��܂������H,����̂���meet�̃C�x���g�ł̏o�X�ɂ��ċ����ĉ������B,����ɂ��āA�ǂ̂悤�Ɋ����܂������B,����̃C�x���g�̏Ɩ��̉��o�ɂ��Ăǂ̂悤�Ɋ����܂������B,����.meet.NIGHT�̊��z�������Ă��������B
2021/12/10 10:44,�Q����,�j��,30��,����s�|�O��,������,�k��,��l,SNS,�荏�ǂ���ʉ߂���܂�,�Q������,���͂ق���,����,"�X�܂����Ȃ�, �����ɕ΂肪������",�K�v�ȏꏊ�ɖ����肪�����Ă��傤�Ǘǂ�,�h�Ђɂ��Ă̈ӎ������܂���,,,,,,,,�X�e�L
2021/12/10 11:00,�Q����,����,10��,�O�͈���{��,���w��,�k��,�ߏ��̐l,��������Ă�����C�Â����I,�I�J�_�J�Y�`�J����̂ӂ邳��,�Q������,�Q�����Ă݂���,����,�X�܂����Ȃ�,�Â�����,�h�Ђɂ��Ă͂��܂肾���A�΂̋N�������ȂǎQ�l�ɂȂ���,,,,,,,,arigatou
2021/12/10 18:31,�Q����,����,20��,��{,��Ј�,�d��,�E��̐l,�֌W�҂���̏Љ�,����Ȃ�,�Q������,���͂ق���,���傤�Ǘǂ�,"�X�܂����Ȃ�, ���͋C���悩����",�Â�����,�h�Ђɂ��Ă͈ӎ����Ȃ�����,,,,,,,,
2021/12/10 18:34,�Q����,�j��,30��,���É��s,��Ј�,�d��,�E��̐l,���R�~,"�荏�ǂ���ʉ߂���܂�, �u���n�v�̂܂�, �����Ă��I",�Q������,���͂ق���,���傤�Ǘǂ�,"�X�܂����Ȃ�, ���͋C���悩����",�Â�����,�킩��Ȃ�,,,,,,,,
2021/12/10 18:38,�Q����,�j��,50��,���[,������,��,�Ƒ�,SNS,"�荏�ǂ���ʉ߂���܂�, �I�J�_�J�Y�`�J����̂ӂ邳��, �u���n�v�̂܂�, �u���񂢂�����v�̂܂�, �u�F�B�ȏ�A���l�����v�̂܂�",�Q������,�Q�����Ă݂���,���傤�Ǘǂ�,���͋C���悩����,�K�v�ȏꏊ�ɖ����肪�����Ă��傤�Ǘǂ�,�h�Ђɂ��Ă͈ӎ����Ȃ�����,,,,,,,,�p�����ė~����
2021/12/10 18:44,�Q����,�j��,50��,���R��,������,���]��,�Ƒ�,���R�~,�����Ă��I,�m��Ȃ�����,���͂ق���,���傤�Ǘǂ�,"�X�܂����Ȃ�, �m���Ă���X�܂���������, �O�͈���̓X�܂ɗ��Ăق���",�Â�����,�h�Ђɂ��Ă̈ӎ������܂���,,,,,,,,
2021/12/10 19:39,����.meet�\����,,,,,,,,,,,,,,,���������I�ɊJ�Â��Ăق���,,�K�v�ȏꏊ�ɖ����肪�����Ă��傤�Ǘǂ�,�h�Ђɂ��Ă͈ӎ����Ȃ�����,,,,
2021/12/10 20:20,�Q����,�j��,50��,���J,��Ј�,�d��,��l,SNS,"�荏�ǂ���ʉ߂���܂�, �u���񂢂�����v�̂܂�, �u�F�B�ȏ�A���l�����v�̂܂�, �����Ă��I",�Q������,,���傤�Ǘǂ�,"�����ɕ΂肪������, ���͋C���悩����, �m���Ă���X�܂���������, �O�͈���̓X�܂ɗ��Ăق���, �O�͈���ȊO�̓X�܂ɂ����Ăق���, �s�O�̓X�܂ɂ����Ăق���",�Â�����,�h�Ђɂ��Ă̈ӎ������܂���,,,,,,,,���肪�Ƃ��������܂��B
2021/12/10 20:45,�Q����,�j��,30��,�����s,���E,��,��l,SNS,�����Ă��I,�m��Ȃ�����,���͂ق���,���傤�Ǘǂ�,���������l������,�K�v�ȏꏊ�ɖ����肪�����Ă��傤�Ǘǂ�,�h�Ђɂ��Ă͈ӎ����Ȃ�����,,,,,,,,
2021/12/10 21:07,�Q����,�j��,30��,�L�c�s,��Ј�,��,��l,SNS,�����Ă��I,�m���Ă������Q�����Ȃ�����,���͂ق���,���傤�Ǘǂ�,���͋C���悩����,�Â�����,�h�Ђɂ��Ă̈ӎ������܂���,,,,,,,,�y���������ł��I
2021/12/10 21:13,�Q����,�j��,40��,�O�͈���{��,���c��,�k��,�F�B,���R�~,�I�J�_�J�Y�`�J����̂ӂ邳��,�Q������,�Q�����Ă݂���,���傤�Ǘǂ�,"�X�܂����Ȃ�, �s�O�̓X�܂ɂ����Ăق���",�Â�����,�h�Ђɂ��Ă͈ӎ����Ȃ�����,,,,,,,,���������I�ɊJ�Â��ė~����
2021/12/10 21:19,�Q����,�j��,50��,������,���c,��,�Ƒ�,SNS,�荏�ǂ���ʉ߂���܂�,�m���Ă������Q�����Ȃ�����,�Q�����Ă݂���,���傤�Ǘǂ�,"�X�܂����Ȃ�, ���͋C���悩����, �m���Ă���X�܂���������, �O�͈���̓X�܂ɗ��Ăق���, �s�O�̓X�܂ɂ����Ăق���",�Â�����,�h�Ђɂ��Ă͈ӎ����Ȃ�����,,,,,,,,�C�x���g���O��������ɂ���
2021/12/11 12:09,����.meet�\����,,,,,,,,,,,,,,,�J�Â��Ăق���,���g�̏o�X�ł͂���܂��񂪁A����Ζ����ԂƉƑ����Ԃ̍��ԂȂ�A���Ԃ̂���`���ł��܂��B,�K�v�ȏꏊ�ɖ����肪�����Ă��傤�Ǘǂ�,�h�Ђɂ��Ă͈ӎ����Ȃ�����,,,,�v�X�ɒ��ԂƓۂ߂Ċy���������ł��B���ƁA�Q�[�����ł��Ă悩�����ł��B
2021/12/11 18:22,�Q����,�j��,40��,�郖����,��Ј�,������,�Ƒ�,SNS,"�荏�ǂ���ʉ߂���܂�, �u�F�B�ȏ�A���l�����v�̂܂�, �ӂ��蕷�������Ƃ���",�m���Ă������Q�����Ȃ�����,�Q�����Ă݂���,���傤�Ǘǂ�,"���������l������, ���͋C���悩����, �O�͈���ȊO�̓X�܂ɂ����Ăق���, �s�O�̓X�܂ɂ����Ăق���",�K�v�ȏꏊ�ɖ����肪�����Ă��傤�Ǘǂ�,�h�Ђɂ��Ă̈ӎ������܂���,,,,,,,,"�a�V�Ŗʔ����B
��������񑱂��ė~�����ł��B"
2021/12/11 21:04,����.meet�\����,,,,,,,,,,,,,,,���������I�ɊJ�Â��Ăق���,,�Â�����,�h�Ђɂ��Ă͈ӎ����Ȃ�����,,,,�����΂����ꂵ��
2021/12/16 21:19,����.meet�\����,,,,,,,,,,,,,,,���������I�ɊJ�Â��Ăق���,,�K�v�ȏꏊ�ɖ����肪�����Ă��傤�Ǘǂ�,�h�Ђɂ��Ă̈ӎ������܂���,,,,
